Build failing on win64

classic Classic list List threaded Threaded
2 messages Options
Reply | Threaded
Open this post in threaded view
|

Build failing on win64

Jeroen Ooms-2
As of commit 78536 earlier this morning the build is failing on
windows 64, see https://r-devel.github.io

I cannot immediately spot what is the problem. The build fails with:

installing 'sysdata.rda'
  make[3]: *** [../../../share/make/basepkg.mk:151: sysdata] Error 127
  make[2]: *** [Makefile.win:22: all] Error 2
  make[1]: *** [Makefile.win:32: R] Error 1

______________________________________________
[hidden email] mailing list
https://stat.ethz.ch/mailman/listinfo/r-devel
Reply | Threaded
Open this post in threaded view
|

Re: Build failing on win64

Tomas Kalibera
Thanks, fixed now.
Tomas

On 5/22/20 10:18 AM, Jeroen Ooms wrote:

> As of commit 78536 earlier this morning the build is failing on
> windows 64, see https://r-devel.github.io
>
> I cannot immediately spot what is the problem. The build fails with:
>
> installing 'sysdata.rda'
>    make[3]: *** [../../../share/make/basepkg.mk:151: sysdata] Error 127
>    make[2]: *** [Makefile.win:22: all] Error 2
>    make[1]: *** [Makefile.win:32: R] Error 1
>
> ______________________________________________
> [hidden email] mailing list
> https://stat.ethz.ch/mailman/listinfo/r-devel

______________________________________________
[hidden email] mailing list
https://stat.ethz.ch/mailman/listinfo/r-devel